Target
Epidermal growth factor receptor
Ligand
BDBM50318958
Substrate
Meas. Tech.
ChEMBL_635331 (CHEMBL1119644)
IC50
>1000±n/a nM
Citation
 Hudkins, RLZulli, ALUnderiner, TLAngeles, TSAimone, LDMeyer, SLPauletti, DChang, HFedorov, EVAlmo, SCFedorov, AARuggeri, BA 8-THP-DHI analogs as potent Type I dual TIE-2/VEGF-R2 receptor tyrosine kinase inhibitors. Bioorg Med Chem Lett 20:3356-60 (2010)  
Target
Name:
Epidermal growth factor receptor
Synonyms:
EGF Receptor Substrate EGFR_HUMAN ERBB1 Epidermal Growth Factor Receptor erbB-1 Epidermal growth factor receptor (EGFR) HER1 Proto-oncogene c-ErbB-1 Tyrosine-Protein Kinase ErbB-1
Type:
Receptor Kinase Domain
Mol. Mass.:
134279.59
Organism:
Homo sapiens (Human)
Description:
P00533
Residue:
1210
  
Inhibitor
Name:
BDBM50318958
Synonyms:
CHEMBL1082829 | rac-9-butyl-5-methyl-12-(tetrahydro-2H-pyran-2-yl)-5,7,8,9-tetrahydro-1H-indazolo[5,4-a]pyrrolo[3,4-c]carbazol-3(2H)-one
Type:
Small organic molecule
Emp. Form.:
C29H32N4O2
Mol. Mass.:
468.59
SMILES:
CCCCn1c2ccc(cc2c2c3CNC(=O)c3c3-c4cn(C)nc4CCc3c12)C1CCCCO1
: