Target
Angiopoietin-1 receptor
Ligand
BDBM50318967
Substrate
Meas. Tech.
ChEMBL_635311 (CHEMBL1119624)
IC50
41±n/a nM
Citation
 Hudkins, RLZulli, ALUnderiner, TLAngeles, TSAimone, LDMeyer, SLPauletti, DChang, HFedorov, EVAlmo, SCFedorov, AARuggeri, BA 8-THP-DHI analogs as potent Type I dual TIE-2/VEGF-R2 receptor tyrosine kinase inhibitors. Bioorg Med Chem Lett 20:3356-60 (2010)  
Target
Name:
Angiopoietin-1 receptor
Synonyms:
TEK TIE2_HUMAN Tyrosine-protein kinase receptor (TIE-2) Tyrosine-protein kinase receptor TEK (p140 TEK) Tyrosine-protein kinase receptor TIE2/TEK VMCM1 p140 TEK
Type:
Enzyme
Mol. Mass.:
125835.70
Organism:
Homo sapiens (Human)
Description:
Q02763
Residue:
1124
  
Inhibitor
Name:
BDBM50318967
Synonyms:
CHEMBL1083454 | rac-9-cyclopentyl-5-methyl-12-(tetrahydro-2H-pyran-2-yl)-5,7,8,9-tetrahydro-1H-indazolo[5,4-a]pyrrolo[3,4-c]carbazol-3(2H)-one
Type:
Small organic molecule
Emp. Form.:
C30H32N4O2
Mol. Mass.:
480.6007
SMILES:
Cn1cc-2c(CCc3c-2c2C(=O)NCc2c2c4cc(ccc4n(C4CCCC4)c32)C2CCCCO2)n1
: