Target
Rho-associated protein kinase 1
Ligand
BDBM50319027
Substrate
Meas. Tech.
ChEMBL_635486 (CHEMBL1117720)
IC50
10±n/a nM
Citation
 Davis, RLKahraman, MPrins, TJBeaver, YCook, TGCramp, JCayanan, CSGardiner, EMMcLaughlin, MAClark, AFHellberg, MRShiau, AKNoble, SABorchardt, AJ Benzothiophene containing Rho kinase inhibitors: Efficacy in an animal model of glaucoma. Bioorg Med Chem Lett 20:3361-6 (2010)  
Target
Name:
Rho-associated protein kinase 1
Synonyms:
ROCK-I ROCK1_HUMAN Rho-associated protein kinase Rho-associated, coiled-coil-containing protein kinase 1 Rho-kinase (ROCK I) p160 ROCK-1 | p160ROCK
Type:
Serine/threonine-protein kinase
Mol. Mass.:
158156.77
Organism:
Homo sapiens (Human)
Description:
Q13464
Residue:
1354
  
Inhibitor
Name:
BDBM50319027
Synonyms:
(+/-)-3-(amino(2-(2-aminopyrimidin-4-yl)-3-methylbenzo[b]thiophen-5-yl)methyl)phenol | CHEMBL1083074
Type:
Small organic molecule
Emp. Form.:
C20H18N4OS
Mol. Mass.:
362.448
SMILES:
Cc1c(sc2ccc(cc12)C(N)c1cccc(O)c1)-c1ccnc(N)n1
: