Target
High affinity cAMP-specific and IBMX-insensitive 3',5'-cyclic phosphodiesterase 8A
Ligand
BDBM50319163
Substrate
Meas. Tech.
ChEMBL_635691 (CHEMBL1120089)
IC50
>1000±n/a nM
Citation
 Höfgen, NStange, HSchindler, RLankau, HJGrunwald, CLangen, BEgerland, UTremmel, PPangalos, MNMarquis, KLHage, THarrison, BLMalamas, MSBrandon, NJKronbach, T Discovery of imidazo[1,5-a]pyrido[3,2-e]pyrazines as a new class of phosphodiesterase 10A inhibitiors. J Med Chem 53:4399-411 (2010)  
Target
Name:
High affinity cAMP-specific and IBMX-insensitive 3',5'-cyclic phosphodiesterase 8A
Synonyms:
High-affinity cAMP-specific and IBMX-insensitive 3 ,5 -cyclic phosphodiesterase 8A PDE8A_HUMAN Phosphodiesterase 8 (PDE8) Phosphodiesterase 8A (PDE8A1) Phosphodiesterase Type 8 (PDE8A)
Type:
Enzyme Catalytic Domain
Mol. Mass.:
93295.89
Organism:
Homo sapiens (Human)
Description:
Recombinant catalytic domain (M1-E829) of human PDE8A.
Residue:
829
  
Inhibitor
Name:
BDBM50319163
Synonyms:
8-Methoxy-3-methyl-4-methylsulfonylamino-1-propyl-imidazo[1,5-a]pyrido[3,2-e]pyrazine | CHEMBL1085374
Type:
Small organic molecule
Emp. Form.:
C15H19N5O3S
Mol. Mass.:
349.408
SMILES:
CCCc1nc(C)c2c(NS(C)(=O)=O)nc3ccc(OC)nc3n12
: