Target
cAMP and cAMP-inhibited cGMP 3',5'-cyclic phosphodiesterase 10A
Ligand
BDBM50319185
Substrate
Meas. Tech.
ChEMBL_635680 (CHEMBL1119709)
IC50
36±n/a nM
Citation
 Höfgen, NStange, HSchindler, RLankau, HJGrunwald, CLangen, BEgerland, UTremmel, PPangalos, MNMarquis, KLHage, THarrison, BLMalamas, MSBrandon, NJKronbach, T Discovery of imidazo[1,5-a]pyrido[3,2-e]pyrazines as a new class of phosphodiesterase 10A inhibitiors. J Med Chem 53:4399-411 (2010)  
Target
Name:
cAMP and cAMP-inhibited cGMP 3',5'-cyclic phosphodiesterase 10A
Synonyms:
3',5'-cyclic phosphodiesterase PDE10A Phosphodiesterase 10 (PDE10) | Phosphodiesterase 10A
Type:
Protein
Mol. Mass.:
88412.52
Organism:
Homo sapiens (Human)
Description:
Q9Y233
Residue:
1055
  
Inhibitor
Name:
BDBM50319185
Synonyms:
4-Cyano-1-ethyl-8-methoxy-3-methyl-imidazo[1,5-a]pyrido-[3,2-e]pyrazine | CHEMBL1085055
Type:
Small organic molecule
Emp. Form.:
C14H13N5O
Mol. Mass.:
267.2859
SMILES:
CCc1nc(C)c2c(nc3ccc(OC)nc3n12)C#N
: