Target
cAMP-specific 3',5'-cyclic phosphodiesterase 4A
Ligand
BDBM50319165
Substrate
Meas. Tech.
ChEMBL_635687 (CHEMBL1119716)
IC50
5000±n/a nM
Citation
 Höfgen, NStange, HSchindler, RLankau, HJGrunwald, CLangen, BEgerland, UTremmel, PPangalos, MNMarquis, KLHage, THarrison, BLMalamas, MSBrandon, NJKronbach, T Discovery of imidazo[1,5-a]pyrido[3,2-e]pyrazines as a new class of phosphodiesterase 10A inhibitiors. J Med Chem 53:4399-411 (2010)  
Target
Name:
cAMP-specific 3',5'-cyclic phosphodiesterase 4A
Synonyms:
3',5'-cyclic phosphodiesterase PDE46 PDE4A_HUMAN Phosphodiesterase 4A | Phosphodiesterase 4A (PDE4)
Type:
Enzyme
Mol. Mass.:
98113.27
Organism:
Homo sapiens (Human)
Description:
P27815
Residue:
886
  
Inhibitor
Name:
BDBM50319165
Synonyms:
2-methoxy-6,7-dimethyl-9-propylimidazo[1,5-a]pyrido[3,2-e]pyrazine CHEMBL1086110
Type:
Small organic molecule
Emp. Form.:
C15H18N4O
Mol. Mass.:
270.3296
SMILES:
CCCc1nc(C)c2c(C)nc3ccc(OC)nc3n12
: