Target
5-hydroxytryptamine receptor 2A
Ligand
BDBM50319429
Substrate
Meas. Tech.
ChEMBL_634056 (CHEMBL1118328)
Ki
4.5±n/a nM
Citation
 Xiong, YTeegarden, BRChoi, JSStrah-Pleynet, SDecaire, MJayakumar, HDosa, PICasper, MDPham, LFeichtinger, KUllman, BAdams, JYuskin, DFrazer, JMorgan, MSadeque, AChen, WWebb, RRConnolly, DTSemple, GAl-Shamma, H Discovery and structure-activity relationship of 3-methoxy-N-(3-(1-methyl-1H-pyrazol-5-yl)-4-(2-morpholinoethoxy)phenyl)benzamide (APD791): a highly selective 5-hydroxytryptamine2A receptor inverse agonist for the treatment of arterial thrombosis. J Med Chem 53:4412-21 (2010)  
Target
Name:
5-hydroxytryptamine receptor 2A
Synonyms:
5-HT-2 5-HT2A 5-hydroxytryptamine receptor 2A (5HT-2A) 5HT2A_HUMAN HTR2A | Serotonin receptor 2A
Type:
undefined
Mol. Mass.:
52607.65
Organism:
Homo sapiens (Human)
Description:
P28223
Residue:
471
  
Inhibitor
Name:
BDBM50319429
Synonyms:
CHEMBL1085854 | N-{4-[2-(4-Acetylpiperazin-1-yl)ethoxy]-3-(1-methyl-1H-pyrazol-5-yl)phenyl}-3-methoxybenzamide
Type:
Small organic molecule
Emp. Form.:
C26H31N5O4
Mol. Mass.:
477.5554
SMILES:
COc1cccc(c1)C(=O)Nc1ccc(OCCN2CCN(CC2)C(C)=O)c(c1)-c1ccnn1C
: