Target
5-hydroxytryptamine receptor 2C
Ligand
BDBM50319426
Substrate
Meas. Tech.
ChEMBL_634057 (CHEMBL1118329)
Ki
5614±n/a nM
Citation
 Xiong, YTeegarden, BRChoi, JSStrah-Pleynet, SDecaire, MJayakumar, HDosa, PICasper, MDPham, LFeichtinger, KUllman, BAdams, JYuskin, DFrazer, JMorgan, MSadeque, AChen, WWebb, RRConnolly, DTSemple, GAl-Shamma, H Discovery and structure-activity relationship of 3-methoxy-N-(3-(1-methyl-1H-pyrazol-5-yl)-4-(2-morpholinoethoxy)phenyl)benzamide (APD791): a highly selective 5-hydroxytryptamine2A receptor inverse agonist for the treatment of arterial thrombosis. J Med Chem 53:4412-21 (2010)  
Target
Name:
5-hydroxytryptamine receptor 2C
Synonyms:
5-HT-2C 5-HT2C-INI 5-HTR2C 5-hydroxytryptamine receptor 2C (5-HT-2C) 5HT-1C HTR1C Serotonin (5-HT3) receptor Serotonin Receptor 2C
Type:
G Protein-Coupled Receptor (GPCR)
Mol. Mass.:
51836.79
Organism:
Homo sapiens (Human)
Description:
P28335
Residue:
458
  
Inhibitor
Name:
BDBM50319426
Synonyms:
CHEMBL1086555 | N-{4-[2-(4-Acetylpiperazin-1-yl)ethoxy]-3-(1-methyl-1H-pyrazol-5-yl)phenyl}-3-(trifluoromethyl)benzamide
Type:
Small organic molecule
Emp. Form.:
C26H28F3N5O3
Mol. Mass.:
515.5274
SMILES:
CC(=O)N1CCN(CCOc2ccc(NC(=O)c3cccc(c3)C(F)(F)F)cc2-c2ccnn2C)CC1
: