Target
5-hydroxytryptamine receptor 2C
Ligand
BDBM50319429
Substrate
Meas. Tech.
ChEMBL_634057 (CHEMBL1118329)
Ki
>10000±n/a nM
Citation
 Xiong, YTeegarden, BRChoi, JSStrah-Pleynet, SDecaire, MJayakumar, HDosa, PICasper, MDPham, LFeichtinger, KUllman, BAdams, JYuskin, DFrazer, JMorgan, MSadeque, AChen, WWebb, RRConnolly, DTSemple, GAl-Shamma, H Discovery and structure-activity relationship of 3-methoxy-N-(3-(1-methyl-1H-pyrazol-5-yl)-4-(2-morpholinoethoxy)phenyl)benzamide (APD791): a highly selective 5-hydroxytryptamine2A receptor inverse agonist for the treatment of arterial thrombosis. J Med Chem 53:4412-21 (2010)  
Target
Name:
5-hydroxytryptamine receptor 2C
Synonyms:
5-HT-2C 5-HT2C-INI 5-HTR2C 5-hydroxytryptamine receptor 2C (5-HT-2C) 5HT-1C HTR1C Serotonin (5-HT3) receptor Serotonin Receptor 2C
Type:
G Protein-Coupled Receptor (GPCR)
Mol. Mass.:
51836.79
Organism:
Homo sapiens (Human)
Description:
P28335
Residue:
458
  
Inhibitor
Name:
BDBM50319429
Synonyms:
CHEMBL1085854 | N-{4-[2-(4-Acetylpiperazin-1-yl)ethoxy]-3-(1-methyl-1H-pyrazol-5-yl)phenyl}-3-methoxybenzamide
Type:
Small organic molecule
Emp. Form.:
C26H31N5O4
Mol. Mass.:
477.5554
SMILES:
COc1cccc(c1)C(=O)Nc1ccc(OCCN2CCN(CC2)C(C)=O)c(c1)-c1ccnn1C
: