Target
5-hydroxytryptamine receptor 2A
Ligand
BDBM50319414
Substrate
Meas. Tech.
ChEMBL_634153 (CHEMBL1119160)
IC50
23±n/a nM
Citation
 Xiong, YTeegarden, BRChoi, JSStrah-Pleynet, SDecaire, MJayakumar, HDosa, PICasper, MDPham, LFeichtinger, KUllman, BAdams, JYuskin, DFrazer, JMorgan, MSadeque, AChen, WWebb, RRConnolly, DTSemple, GAl-Shamma, H Discovery and structure-activity relationship of 3-methoxy-N-(3-(1-methyl-1H-pyrazol-5-yl)-4-(2-morpholinoethoxy)phenyl)benzamide (APD791): a highly selective 5-hydroxytryptamine2A receptor inverse agonist for the treatment of arterial thrombosis. J Med Chem 53:4412-21 (2010)  
Target
Name:
5-hydroxytryptamine receptor 2A
Synonyms:
5-HT-2 5-HT2A 5-hydroxytryptamine receptor 2A (5HT-2A) 5HT2A_HUMAN HTR2A | Serotonin receptor 2A
Type:
undefined
Mol. Mass.:
52607.65
Organism:
Homo sapiens (Human)
Description:
P28223
Residue:
471
  
Inhibitor
Name:
BDBM50319414
Synonyms:
CHEMBL1085155 | [3-(2-Methyl-2H-pyrazol-3-yl)-4-(2-pyrrolidin-1-yl-ethoxy)-phenyl]-3-trifluoromethyl-benzamide
Type:
Small organic molecule
Emp. Form.:
C24H25F3N4O2
Mol. Mass.:
458.4761
SMILES:
Cn1nccc1-c1cc(NC(=O)c2cccc(c2)C(F)(F)F)ccc1OCCN1CCCC1
: