Target
Prostaglandin D2 receptor 2
Ligand
BDBM50319490
Substrate
Meas. Tech.
ChEMBL_634231 (CHEMBL1120178)
Ki
29±n/a nM
Citation
 Tumey, LNRobarge, MJGleason, ESong, JMurphy, SMEkema, GDoucette, CHanniford, DPalmer, MPawlowski, GDanzig, JLoftus, MHunady, KSherf, BMays, RWStricker-Krongrad, ABrunden, KRBennani, YLHarrington, JJ 3-Indolyl sultams as selective CRTh2 antagonists. Bioorg Med Chem Lett 20:3287-90 (2010)  
Target
Name:
Prostaglandin D2 receptor 2
Synonyms:
CD_antigen=CD294 Chemoattractant Receptor-homologous molecule expressed on T-helper type 2 cells (CRTH2) Chemoattractant receptor-homologous molecule expressed on Th2 cells (CRTH2) G protein-coupled receptor 44 GPR44 PTGDR2 Prostaglandin D2 receptor 2 | Prostaglandin D2 receptor 2 (PGD2)
Type:
Enzyme
Mol. Mass.:
43295.45
Organism:
Homo sapiens (Human)
Description:
Q9Y5Y4
Residue:
395
  
Inhibitor
Name:
BDBM50319490
Synonyms:
CHEMBL1084903 | rac-{3-[1,1-Dioxo-2-(2-phenoxy-ethyl)-2,3-dihydro-1H-1lambda*6*-benzo[d]isothiazol-3-yl]-2-methyl-indol-1-yl}-acetic acid
Type:
Small organic molecule
Emp. Form.:
C26H24N2O5S
Mol. Mass.:
476.544
SMILES:
Cc1c(C2N(CCOc3ccccc3)S(=O)(=O)c3ccccc23)c2ccccc2n1CC(O)=O
: