Target
Angiopoietin-1 receptor
Ligand
BDBM50319572
Substrate
Meas. Tech.
ChEMBL_634312 (CHEMBL1120725)
IC50
2±n/a nM
Citation
 Cheng, ACEksterowicz, JGeuns-Meyer, SSun, Y Analysis of kinase inhibitor selectivity using a thermodynamics-based partition index. J Med Chem 53:4502-10 (2010)  
Target
Name:
Angiopoietin-1 receptor
Synonyms:
TEK TIE2_HUMAN Tyrosine-protein kinase receptor (TIE-2) Tyrosine-protein kinase receptor TEK (p140 TEK) Tyrosine-protein kinase receptor TIE2/TEK VMCM1 p140 TEK
Type:
Enzyme
Mol. Mass.:
125835.70
Organism:
Homo sapiens (Human)
Description:
Q02763
Residue:
1124
  
Inhibitor
Name:
BDBM50319572
Synonyms:
CHEMBL1084452 | N-(4-(3-(2-(2-(1-methylpyrrolidin-2-yl)ethylamino)pyrimidin-4-yl)pyridin-2-yloxy)naphthalen-1-yl)-1H-benzo[d]imidazol-2-amine
Type:
Small organic molecule
Emp. Form.:
C33H32N8O
Mol. Mass.:
556.6602
SMILES:
CN1CCCC1CCNc1nccc(n1)-c1cccnc1Oc1ccc(Nc2nc3ccccc3[nH]2)c2ccccc12
: