Target
Potassium voltage-gated channel subfamily H member 2
Ligand
BDBM50319580
Substrate
Meas. Tech.
ChEMBL_634333 (CHEMBL1120746)
IC50
8000±n/a nM
Citation
 O'Neill, DJAdedoyin, AAlfinito, PDBray, JACosmi, SDeecher, DCFensome, AHarrison, JLeventhal, LMann, CMcComas, CCSullivan, NRSpangler, TBUveges, AJTrybulski, EJWhiteside, GTZhang, P Discovery of novel selective norepinephrine reuptake inhibitors: 4-[3-aryl-2,2-dioxido-2,1,3-benzothiadiazol-1(3H)-yl]-1-(methylamino)butan-2-ols (WYE-103231). J Med Chem 53:4511-21 (2010)  
Target
Name:
Potassium voltage-gated channel subfamily H member 2
Synonyms:
1,3-beta-glucan synthase component GLS2 ERG Eag-related protein 1 Ether-a-go-go-related gene (HERG) Ether-a-go-go-related gene potassium channel 1 Ether-a-go-go-related gene potassium channel 1 (hERG1) Ether-a-go-go-related protein 1 H-ERG KCNH2 Potassium voltage-gated channel subfamily H member 2 (hERG) Voltage-gated potassium channel subunit Kv11.1 hERG Potassium Channel 1 | putative potassium channel subunit
Type:
Multi-pass membrane protein
Mol. Mass.:
126672.65
Organism:
Homo sapiens (Human)
Description:
Q12809
Residue:
1159
  
Inhibitor
Name:
BDBM50319580
Synonyms:
(2S)-4-(2,2-Dioxido-3-phenyl-2,1,3-benzothiadiazol-1(3H)-yl)-1-(methylamino)butan-2-ol | CHEMBL1083409
Type:
Small organic molecule
Emp. Form.:
C17H21N3O3S
Mol. Mass.:
347.432
SMILES:
CNC[C@@H](O)CCN1c2ccccc2N(c2ccccc2)S1(=O)=O
: