Target
Sodium-dependent dopamine transporter
Ligand
BDBM50319589
Substrate
Meas. Tech.
ChEMBL_634325 (CHEMBL1120738)
IC50
2570±n/a nM
Citation
 O'Neill, DJAdedoyin, AAlfinito, PDBray, JACosmi, SDeecher, DCFensome, AHarrison, JLeventhal, LMann, CMcComas, CCSullivan, NRSpangler, TBUveges, AJTrybulski, EJWhiteside, GTZhang, P Discovery of novel selective norepinephrine reuptake inhibitors: 4-[3-aryl-2,2-dioxido-2,1,3-benzothiadiazol-1(3H)-yl]-1-(methylamino)butan-2-ols (WYE-103231). J Med Chem 53:4511-21 (2010)  
Target
Name:
Sodium-dependent dopamine transporter
Synonyms:
DA transporter DAT1 Dopamine transporter protein (DAT) SC6A3_HUMAN Sodium-dependent dopamine transporter Solute carrier family 6 member 3
Type:
Multi-pass membrane protein
Mol. Mass.:
68497.11
Organism:
Homo sapiens (Human)
Description:
Q01959
Residue:
620
  
Inhibitor
Name:
BDBM50319589
Synonyms:
(2S)-(4-[3-(3-Methoxyphenyl)-2,2-dioxido-2,1,3-benzothiadiazol-1(3H)-yl]-1-(methylamino)butan-2-ol | CHEMBL1085323
Type:
Small organic molecule
Emp. Form.:
C18H23N3O4S
Mol. Mass.:
377.458
SMILES:
CNC[C@@H](O)CCN1c2ccccc2N(c2cccc(OC)c2)S1(=O)=O
: