Target
11-beta-hydroxysteroid dehydrogenase 1
Ligand
BDBM50319660
Substrate
Meas. Tech.
ChEMBL_634656 (CHEMBL1118096)
Ki
329±n/a nM
Citation
 Véniant, MMHale, CHungate, RWGahm, KEmery, MGJona, JJoseph, SAdams, JHague, AMoniz, GZhang, JBartberger, MDLi, VSyed, RJordan, SKomorowski, RChen, MMCupples, RKim, KWSt Jean, DJJohansson, LHenriksson, MAWilliams, MVallgårda, JFotsch, CWang, M Discovery of a potent, orally active 11beta-hydroxysteroid dehydrogenase type 1 inhibitor for clinical study: identification of (S)-2-((1S,2S,4R)-bicyclo[2.2.1]heptan-2-ylamino)-5-isopropyl-5-methylthiazol-4(5H)-one (AMG 221). J Med Chem 53:4481-7 (2010)  
Target
Name:
11-beta-hydroxysteroid dehydrogenase 1
Synonyms:
11-DH 11-beta-Hydroxysteroid Dehydrogenase 1 (11-beta-HSD1) 11-beta-hydroxysteroid dehydrogenase 1 (11HSD1) Corticosteroid 11-beta-dehydrogenase isozyme 1 (11-beta-HSD-1) Corticosteroid 11-beta-dehydrogenase isozyme 1 (11beta-HSD1) HSD11 HSD11L | SDR26C1
Type:
Enzyme
Mol. Mass.:
32409.16
Organism:
Homo sapiens (Human)
Description:
P28845
Residue:
292
  
Inhibitor
Name:
BDBM50319660
Synonyms:
(S)-2-((1S,2S,4R)-Bicyclo[2.2.1]heptan-2-ylamino)-5-isopropylthiazol-4(5H)-one CHEMBL1085840
Type:
Small organic molecule
Emp. Form.:
C13H20N2OS
Mol. Mass.:
252.376
SMILES:
CC(C)c1sc(N[C@H]2C[C@@H]3CC[C@H]2C3)nc1O
: