Target
Vasopressin V2 receptor
Ligand
BDBM85095
Substrate
Meas. Tech.
ChEMBL_634857 (CHEMBL1120489)
Ki
0.36±n/a nM
Citation
 Crombie, ALAntrilli, TMCampbell, BACrandall, DLFailli, AAHe, YKern, JCMoore, WJNogle, LMTrybulski, EJ Synthesis and evaluation of azabicyclo[3.2.1]octane derivatives as potent mixed vasopressin antagonists. Bioorg Med Chem Lett 20:3742-5 (2010)  
Target
Name:
Vasopressin V2 receptor
Synonyms:
ADHR AVPR2 DIR Renal-type arginine vasopressin receptor V2R_HUMAN Vasopressin V2 receptor | Vasopressin receptor
Type:
Receptor
Mol. Mass.:
40295.28
Organism:
Homo sapiens (Human)
Description:
P30518
Residue:
371
  
Inhibitor
Name:
BDBM85095
Synonyms:
CAS_151171 NSC_151171 | YM087
Type:
Small organic molecule
Emp. Form.:
C32H26N4O2
Mol. Mass.:
498.5744
SMILES:
Cc1nc-2c(CCN(C(=O)c3ccc(NC(=O)c4ccccc4-c4ccccc4)cc3)c3ccccc-23)[nH]1
: