Target
Corticotropin-releasing factor receptor 1
Ligand
BDBM50319893
Substrate
Meas. Tech.
ChEMBL_635026 (CHEMBL1118577)
Ki
5.3±n/a nM
Citation
 Zuev, DVrudhula, VMMichne, JADasgupta, BPin, SSHuang, XSWu, DGao, QZhang, JTaber, MTMacor, JEDubowchik, GM Discovery of 6-chloro-2-trifluoromethyl-7-aryl-7H-imidazo[1,2-a]imidazol-3-ylmethylamines, a novel class of corticotropin-releasing factor receptor type 1 (CRF1R) antagonists. Bioorg Med Chem Lett 20:3669-74 (2010)  
Target
Name:
Corticotropin-releasing factor receptor 1
Synonyms:
CRF-R CRF1 CRFR1 CRH-R 1 CRHR1 Corticotropin-releasing factor receptor 1 (CRF-1) Corticotropin-releasing hormone receptor 1
Type:
Enzyme
Mol. Mass.:
50744.31
Organism:
Homo sapiens (Human)
Description:
P34998
Residue:
444
  
Inhibitor
Name:
BDBM50319893
Synonyms:
CHEMBL1083952 | N-((2-chloro-1-mesityl-6-(trifluoromethyl)-1H-imidazo[1,2-a]imidazol-5-yl)methyl)-N-(cyclobutylmethyl)propan-1-amine
Type:
Small organic molecule
Emp. Form.:
C24H30ClF3N4
Mol. Mass.:
466.97
SMILES:
CCCN(CC1CCC1)Cc1c(nc2n(c(Cl)cn12)-c1c(C)cc(C)cc1C)C(F)(F)F
: