Target
Corticotropin-releasing factor receptor 1
Ligand
BDBM50319906
Substrate
Meas. Tech.
ChEMBL_635026 (CHEMBL1118577)
Ki
5.2±n/a nM
Citation
 Zuev, DVrudhula, VMMichne, JADasgupta, BPin, SSHuang, XSWu, DGao, QZhang, JTaber, MTMacor, JEDubowchik, GM Discovery of 6-chloro-2-trifluoromethyl-7-aryl-7H-imidazo[1,2-a]imidazol-3-ylmethylamines, a novel class of corticotropin-releasing factor receptor type 1 (CRF1R) antagonists. Bioorg Med Chem Lett 20:3669-74 (2010)  
Target
Name:
Corticotropin-releasing factor receptor 1
Synonyms:
CRF-R CRF1 CRFR1 CRH-R 1 CRHR1 Corticotropin-releasing factor receptor 1 (CRF-1) Corticotropin-releasing hormone receptor 1
Type:
Enzyme
Mol. Mass.:
50744.31
Organism:
Homo sapiens (Human)
Description:
P34998
Residue:
444
  
Inhibitor
Name:
BDBM50319906
Synonyms:
CHEMBL1083933 | N-((2-chloro-1-mesityl-6-(trifluoromethyl)-1H-imidazo[1,2-a]imidazol-5-yl)methyl)-N-(cyclopropylmethyl)-2,2,2-trifluoroethanamine
Type:
Small organic molecule
Emp. Form.:
C22H23ClF6N4
Mol. Mass.:
492.888
SMILES:
Cc1cc(C)c(c(C)c1)-n1c(Cl)cn2c(CN(CC3CC3)CC(F)(F)F)c(nc12)C(F)(F)F
: