Target
Neuronal acetylcholine receptor subunit alpha-7
Ligand
BDBM50319949
Substrate
Meas. Tech.
ChEMBL_635043 (CHEMBL1118594)
Ki
1±n/a nM
Citation
 Li, TBunnelle, WHRyther, KBAnderson, DJMalysz, JHelfrich, RGrønlien, JHHåkerud, MPeters, DSchrimpf, MRGopalakrishnan, MJi, J Syntheses and structure-activity relationship (SAR) studies of 2,5-diazabicyclo[2.2.1]heptanes as novel alpha7 neuronal nicotinic receptor (NNR) ligands. Bioorg Med Chem Lett 20:3636-9 (2010)  
Target
Name:
Neuronal acetylcholine receptor subunit alpha-7
Synonyms:
ACHA7_RAT Cholinergic, Nicotinic Alpha7 Chrna7 Neuronal acetylcholine receptor (alpha7 nAChR) Neuronal acetylcholine receptor subunit alpha-7 Neuronal acetylcholine receptor subunit alpha-7 (nAChR)
Type:
Enzyme
Mol. Mass.:
56502.44
Organism:
Rattus norvegicus (Rat)
Description:
Q05941
Residue:
502
  
Inhibitor
Name:
BDBM50319949
Synonyms:
5-(5-((1S,4S)-5-methyl-2,5-diazabicyclo[2.2.1]heptan-2-yl)pyrazin-2-yl)-1H-indole | CHEMBL1082466
Type:
Small organic molecule
Emp. Form.:
C18H19N5
Mol. Mass.:
305.377
SMILES:
CN1C[C@@H]2C[C@H]1CN2c1cnc(cn1)-c1ccc2[nH]ccc2c1
: