Target
Potassium voltage-gated channel subfamily H member 2
Ligand
BDBM50319938
Substrate
Meas. Tech.
ChEMBL_635046 (CHEMBL1118597)
Ki
1.8±n/a nM
Citation
 Li, TBunnelle, WHRyther, KBAnderson, DJMalysz, JHelfrich, RGrønlien, JHHåkerud, MPeters, DSchrimpf, MRGopalakrishnan, MJi, J Syntheses and structure-activity relationship (SAR) studies of 2,5-diazabicyclo[2.2.1]heptanes as novel alpha7 neuronal nicotinic receptor (NNR) ligands. Bioorg Med Chem Lett 20:3636-9 (2010)  
Target
Name:
Potassium voltage-gated channel subfamily H member 2
Synonyms:
1,3-beta-glucan synthase component GLS2 ERG Eag-related protein 1 Ether-a-go-go-related gene (HERG) Ether-a-go-go-related gene potassium channel 1 Ether-a-go-go-related gene potassium channel 1 (hERG1) Ether-a-go-go-related protein 1 H-ERG KCNH2 Potassium voltage-gated channel subfamily H member 2 (hERG) Voltage-gated potassium channel subunit Kv11.1 hERG Potassium Channel 1 | putative potassium channel subunit
Type:
Multi-pass membrane protein
Mol. Mass.:
126672.65
Organism:
Homo sapiens (Human)
Description:
Q12809
Residue:
1159
  
Inhibitor
Name:
BDBM50319938
Synonyms:
(1S,4S)-2-(6-(benzo[b]thiophen-5-yl)pyridazin-3-yl)-5-methyl-2,5-diazabicyclo[2.2.1]heptane | CHEMBL1083302
Type:
Small organic molecule
Emp. Form.:
C18H18N4S
Mol. Mass.:
322.427
SMILES:
CN1C[C@@H]2C[C@H]1CN2c1ccc(nn1)-c1ccc2sccc2c1
: