Target
Prolyl endopeptidase FAP
Ligand
BDBM11695
Substrate
Meas. Tech.
ChEMBL_635368 (CHEMBL1119681)
IC50
>100000±n/a nM
Citation
 Yeh, TKTsai, TYHsu, TCheng, JHChen, XSong, JSShy, HSChiou, MCChien, CHTseng, YJHuang, CYYeh, KCHuang, YLHuang, CHHuang, YWWang, MHTang, HKChao, YSChen, CTJiaang, WT (2S,4S)-1-[2-(1,1-dimethyl-3-oxo-3-pyrrolidin-1-yl-propylamino)acetyl]-4-fluoro-pyrrolidine-2-carbonitrile: a potent, selective, and orally bioavailable dipeptide-derived inhibitor of dipeptidyl peptidase IV. Bioorg Med Chem Lett 20:3596-600 (2010)  
Target
Name:
Prolyl endopeptidase FAP
Synonyms:
170 kDa melanoma membrane-bound gelatinase Fibroblast Activation Protein (FAP) Integral membrane serine protease Seprase
Type:
Enzyme
Mol. Mass.:
87712.48
Organism:
Homo sapiens (Human)
Description:
Q12884
Residue:
760
  
Inhibitor
Name:
BDBM11695
Synonyms:
(2S)-1-{2-[(3-hydroxyadamantan-1-yl)amino]acetyl}pyrrolidine-2-carbonitrile NVP-LAF237
Type:
Small organic molecule
Emp. Form.:
C17H25N3O2
Mol. Mass.:
303.3993
SMILES:
OC12CC3CC(C1)CC(C3)(C2)NCC(=O)N1CCC[C@H]1C#N
: