Target
Dipeptidyl peptidase 4
Ligand
BDBM50320123
Substrate
Meas. Tech.
ChEMBL_635373 (CHEMBL1119686)
IC50
847±n/a nM
Citation
 Yeh, TKTsai, TYHsu, TCheng, JHChen, XSong, JSShy, HSChiou, MCChien, CHTseng, YJHuang, CYYeh, KCHuang, YLHuang, CHHuang, YWWang, MHTang, HKChao, YSChen, CTJiaang, WT (2S,4S)-1-[2-(1,1-dimethyl-3-oxo-3-pyrrolidin-1-yl-propylamino)acetyl]-4-fluoro-pyrrolidine-2-carbonitrile: a potent, selective, and orally bioavailable dipeptide-derived inhibitor of dipeptidyl peptidase IV. Bioorg Med Chem Lett 20:3596-600 (2010)  
Target
Name:
Dipeptidyl peptidase 4
Synonyms:
ADABP Adenosine deaminase complexing protein 2 CD_antigen=CD26 DPP4 DPPIV Dipeptidyl peptidase 4 (DPP IV) Dipeptidyl peptidase 4 (DPP4) Dipeptidyl peptidase 4 membrane form Dipeptidyl peptidase IV Dipeptidyl peptidase IV (DDP-IV) Dipeptidyl peptidase IV membrane form Dipeptidyl peptidase-IV (DPP-4) T-cell activation antigen CD26 | TP103
Type:
Enzyme
Mol. Mass.:
88271.01
Organism:
Homo sapiens (Human)
Description:
P27487
Residue:
766
  
Inhibitor
Name:
BDBM50320123
Synonyms:
CHEMBL1082996 | trans-N-(2-(3-chlorophenyl)cyclopropyl)-3-(2-((S)-2-cyanopyrrolidin-1-yl)-2-oxoethylamino)-3-methylbutanamide
Type:
Small organic molecule
Emp. Form.:
C22H26ClFN2O2
Mol. Mass.:
404.905
SMILES:
CC(C)(CC(=O)N[C@H]1C[C@@H]1c1cccc(Cl)c1)CC(=O)N1C[C@@H](F)C[C@H]1C#C
: