Target
Dipeptidyl peptidase 4
Ligand
BDBM50320306
Substrate
Meas. Tech.
ChEMBL_635725 (CHEMBL1120123)
IC50
27±n/a nM
Citation
 Cho, TPGang, LZLong, YFYang, WQian, WLei, ZJing, LJYing, FKe, YPYing, LJun, F Synthesis and biological evaluation of bicyclo[3.3.0] octane derivatives as dipeptidyl peptidase 4 inhibitors for the treatment of type 2 diabetes. Bioorg Med Chem Lett 20:3521-5 (2010)  
Target
Name:
Dipeptidyl peptidase 4
Synonyms:
ADABP Adenosine deaminase complexing protein 2 CD_antigen=CD26 DPP4 DPPIV Dipeptidyl peptidase 4 (DPP IV) Dipeptidyl peptidase 4 (DPP4) Dipeptidyl peptidase 4 membrane form Dipeptidyl peptidase IV Dipeptidyl peptidase IV (DDP-IV) Dipeptidyl peptidase IV membrane form Dipeptidyl peptidase-IV (DPP-4) T-cell activation antigen CD26 | TP103
Type:
Enzyme
Mol. Mass.:
88271.01
Organism:
Homo sapiens (Human)
Description:
P27487
Residue:
766
  
Inhibitor
Name:
BDBM50320306
Synonyms:
(S)-1-(2-((2beta,3aR,5R,6aS)-5-methoxyoctahydropentalen-2-ylamino)acetyl)pyrrolidine-2-carbonitrile hydrochloride | CHEMBL1082346
Type:
Small organic molecule
Emp. Form.:
C16H25N3O2
Mol. Mass.:
291.3886
SMILES:
CO[C@H]1C[C@@H]2C[C@@H](C[C@@H]2C1)NCC(=O)N1CCC[C@H]1C#N
: