Target
Cholesteryl ester transfer protein
Ligand
BDBM50128171
Substrate
Meas. Tech.
ChEMBL_636763 (CHEMBL1167052)
IC50
400±n/a nM
Citation
 Abu Khalaf, RAbu Sheikha, GBustanji, YTaha, MO Discovery of new cholesteryl ester transfer protein inhibitors via ligand-based pharmacophore modeling and QSAR analysis followed by synthetic exploration. Eur J Med Chem 45:1598-617 (2010)  
Target
Name:
Cholesteryl ester transfer protein
Synonyms:
CETP | CETP_RABIT
Type:
PROTEIN
Mol. Mass.:
54513.38
Organism:
Oryctolagus cuniculus
Description:
ChEMBL_1504757
Residue:
497
  
Inhibitor
Name:
BDBM50128171
Synonyms:
1,1,1-Trifluoro-3-{[3-(1,1,2,2-tetrafluoro-ethoxy)-benzyl]-[3-(4-trifluoromethoxy-phenoxy)-phenyl]-amino}-propan-2-ol 3-((3-(1,1,2,2-tetrafluoroethoxy)benzyl)(3-(4-(trifluoromethoxy)phenoxy)phenyl)amino)-1,1,1-trifluoropropan-2-ol | CHEMBL431366
Type:
Small organic molecule
Emp. Form.:
C25H19F10NO4
Mol. Mass.:
587.4067
SMILES:
OC(CN(Cc1cccc(OC(F)(F)C(F)F)c1)c1cccc(Oc2ccc(OC(F)(F)F)cc2)c1)C(F)(F)F
: