Target
Cholesteryl ester transfer protein
Ligand
BDBM50094519
Substrate
Meas. Tech.
ChEMBL_636763 (CHEMBL1167052)
IC50
20±n/a nM
Citation
 Abu Khalaf, RAbu Sheikha, GBustanji, YTaha, MO Discovery of new cholesteryl ester transfer protein inhibitors via ligand-based pharmacophore modeling and QSAR analysis followed by synthetic exploration. Eur J Med Chem 45:1598-617 (2010)  
Target
Name:
Cholesteryl ester transfer protein
Synonyms:
CETP | CETP_RABIT
Type:
PROTEIN
Mol. Mass.:
54513.38
Organism:
Oryctolagus cuniculus
Description:
ChEMBL_1504757
Residue:
497
  
Inhibitor
Name:
BDBM50094519
Synonyms:
(R)-1,1,1-Trifluoro-3-{(3-phenoxy-phenyl)-[3-(1,1,2,2-tetrafluoro-ethoxy)-benzyl]-amino}-propan-2-ol (R)-3-((3-(1,1,2,2-tetrafluoroethoxy)benzyl)(3-phenoxyphenyl)amino)-1,1,1-trifluoropropan-2-ol CHEMBL303954 | SC-795
Type:
Small organic molecule
Emp. Form.:
C24H20F7NO3
Mol. Mass.:
503.4093
SMILES:
O[C@H](CN(Cc1cccc(OC(F)(F)C(F)F)c1)c1cccc(Oc2ccccc2)c1)C(F)(F)F
: