Target
Cholesteryl ester transfer protein
Ligand
BDBM50128140
Substrate
Meas. Tech.
ChEMBL_636763 (CHEMBL1167052)
IC50
45±n/a nM
Citation
 Abu Khalaf, RAbu Sheikha, GBustanji, YTaha, MO Discovery of new cholesteryl ester transfer protein inhibitors via ligand-based pharmacophore modeling and QSAR analysis followed by synthetic exploration. Eur J Med Chem 45:1598-617 (2010)  
Target
Name:
Cholesteryl ester transfer protein
Synonyms:
CETP | CETP_RABIT
Type:
PROTEIN
Mol. Mass.:
54513.38
Organism:
Oryctolagus cuniculus
Description:
ChEMBL_1504757
Residue:
497
  
Inhibitor
Name:
BDBM50128140
Synonyms:
(R)-3-((3-(4-chloro-3-ethylphenoxy)phenyl)(3-(perfluoroethyl)benzyl)amino)-1,1,1-trifluoropropan-2-ol CHEMBL69415
Type:
Small organic molecule
Emp. Form.:
C26H22ClF8NO2
Mol. Mass.:
567.899
SMILES:
CCc1cc(Oc2cccc(c2)N(C[C@@H](O)C(F)(F)F)Cc2cccc(c2)C(F)(F)C(F)(F)F)ccc1Cl
: