Target
Histone deacetylase 2
Ligand
BDBM19423
Substrate
Meas. Tech.
ChEMBL_638008 (CHEMBL1166729)
IC50
100±n/a nM
Citation
 Bertrand, P Inside HDAC with HDAC inhibitors. Eur J Med Chem 45:2095-116 (2010)  
Target
Name:
Histone deacetylase 2
Synonyms:
Cereblon/Histone deacetylase 2 HDAC2 Histone deacetylase 2 (HDAC2) | Human HDAC2
Type:
Chromatin regulator; hydrolase; repressor
Mol. Mass.:
55356.54
Organism:
Homo sapiens (Human)
Description:
Q92769
Residue:
488
  
Inhibitor
Name:
BDBM19423
Synonyms:
HDAC inhibitor, Compound 1 N-[2-amino-5-(thiophen-2-yl)phenyl]-4-acetamidobenzamide (60) benzamide-type inhibitor, 19
Type:
Small organic molecule
Emp. Form.:
C19H17N3O2S
Mol. Mass.:
351.422
SMILES:
CC(=O)Nc1ccc(cc1)C(=O)Nc1cc(ccc1N)-c1cccs1
: