Target
Beta-secretase 1
Ligand
BDBM16034
Substrate
Meas. Tech.
ChEMBL_638489 (CHEMBL1166256)
IC50
250±n/a nM
Citation
 Choi, SJCho, JHIm, ILee, SDJang, JYOh, YMJung, YKJeon, ESKim, YC Design and synthesis of 1,4-dihydropyridine derivatives as BACE-1 inhibitors. Eur J Med Chem 45:2578-90 (2010)  
Target
Name:
Beta-secretase 1
Synonyms:
ASP2 Aspartyl protease 2 BACE1 Beta-secretase (BACE) Beta-secretase 1 (BACE 1) Beta-secretase 1 (BACE1) Beta-site amyloid precursor protein cleaving enzyme 1 Memapsin-2 beta-Secretase (BACE-1) | beta-Secretase (BACE1)
Type:
Protein
Mol. Mass.:
55755.10
Organism:
Homo sapiens (Human)
Description:
P56817
Residue:
501
  
Inhibitor
Name:
BDBM16034
Synonyms:
1-N-[(2S,3R)-4-(cyclopropylamino)-3-hydroxy-1-phenylbutan-2-yl]-5-(N-methylmethanesulfonamido)-3-N-[(1R)-1-phenylethyl]benzene-1,3-dicarboxamide CHEMBL378225 L-000384950 hydroxyethylamine (HEA) derived inhibitor 1
Type:
Small organic molecule
Emp. Form.:
C31H38N4O5S
Mol. Mass.:
578.722
SMILES:
C[C@@H](NC(=O)c1cc(cc(c1)C(=O)N[C@@H](Cc1ccccc1)[C@H](O)CNC1CC1)N(C)S(C)(=O)=O)c1ccccc1
: