Target
Beta-secretase 1
Ligand
BDBM50320678
Substrate
Meas. Tech.
ChEMBL_638726 (CHEMBL1169087)
IC50
500000±n/a nM
Citation
 Al-Nadaf, AAbu Sheikha, GTaha, MO Elaborate ligand-based pharmacophore exploration and QSAR analysis guide the synthesis of novel pyridinium-based potent beta-secretase inhibitory leads. Bioorg Med Chem 18:3088-115 (2010)  
Target
Name:
Beta-secretase 1
Synonyms:
ASP2 Aspartyl protease 2 BACE1 Beta-secretase (BACE) Beta-secretase 1 (BACE 1) Beta-secretase 1 (BACE1) Beta-site amyloid precursor protein cleaving enzyme 1 Memapsin-2 beta-Secretase (BACE-1) | beta-Secretase (BACE1)
Type:
Protein
Mol. Mass.:
55755.10
Organism:
Homo sapiens (Human)
Description:
P56817
Residue:
501
  
Inhibitor
Name:
BDBM50320678
Synonyms:
5-(4-morpholino-3-(p-tolylcarbamoyl)phenylamino)-5-oxopentanoic acid | CHEMBL1164329
Type:
Small organic molecule
Emp. Form.:
C23H27N3O5
Mol. Mass.:
425.4776
SMILES:
Cc1ccc(NC(=O)c2cc(NC(=O)CCCC(O)=O)ccc2N2CCOCC2)cc1
: