Target
Beta-secretase 1
Ligand
BDBM50320615
Substrate
Meas. Tech.
ChEMBL_638726 (CHEMBL1169087)
IC50
81800±n/a nM
Citation
 Al-Nadaf, AAbu Sheikha, GTaha, MO Elaborate ligand-based pharmacophore exploration and QSAR analysis guide the synthesis of novel pyridinium-based potent beta-secretase inhibitory leads. Bioorg Med Chem 18:3088-115 (2010)  
Target
Name:
Beta-secretase 1
Synonyms:
ASP2 Aspartyl protease 2 BACE1 Beta-secretase (BACE) Beta-secretase 1 (BACE 1) Beta-secretase 1 (BACE1) Beta-site amyloid precursor protein cleaving enzyme 1 Memapsin-2 beta-Secretase (BACE-1) | beta-Secretase (BACE1)
Type:
Protein
Mol. Mass.:
55755.10
Organism:
Homo sapiens (Human)
Description:
P56817
Residue:
501
  
Inhibitor
Name:
BDBM50320615
Synonyms:
2,6-dibromo-4-((2-(4-(2,5-dimethylphenylamino)-6-morpholino-1,3,5-triazin-2-yl)hydrazono)methyl)-3-methylphenol | CHEMBL1163698
Type:
Small organic molecule
Emp. Form.:
C23H25Br2N7O2
Mol. Mass.:
591.298
SMILES:
Cc1ccc(C)c(Nc2nc(N=NCc3cc(Br)c(O)c(Br)c3C)nc(n2)N2CCOCC2)c1
: