Target
Beta-secretase 1
Ligand
BDBM16730
Substrate
Meas. Tech.
ChEMBL_638726 (CHEMBL1169087)
IC50
110±n/a nM
Citation
 Al-Nadaf, AAbu Sheikha, GTaha, MO Elaborate ligand-based pharmacophore exploration and QSAR analysis guide the synthesis of novel pyridinium-based potent beta-secretase inhibitory leads. Bioorg Med Chem 18:3088-115 (2010)  
Target
Name:
Beta-secretase 1
Synonyms:
ASP2 Aspartyl protease 2 BACE1 Beta-secretase (BACE) Beta-secretase 1 (BACE 1) Beta-secretase 1 (BACE1) Beta-site amyloid precursor protein cleaving enzyme 1 Memapsin-2 beta-Secretase (BACE-1) | beta-Secretase (BACE1)
Type:
Protein
Mol. Mass.:
55755.10
Organism:
Homo sapiens (Human)
Description:
P56817
Residue:
501
  
Inhibitor
Name:
BDBM16730
Synonyms:
N-{2-[4-(2-hydroxyethyl)piperazin-1-yl]-5-phenylphenyl}naphthalene-1-carboxamide | Naphthyl Compound, 5a
Type:
Small organic molecule
Emp. Form.:
C29H29N3O2
Mol. Mass.:
451.5595
SMILES:
OCCN1CCN(CC1)c1ccc(cc1NC(=O)c1cccc2ccccc12)-c1ccccc1
: