Target
Beta-secretase 1
Ligand
BDBM50320652
Substrate
Meas. Tech.
ChEMBL_638726 (CHEMBL1169087)
IC50
100000±n/a nM
Citation
 Al-Nadaf, AAbu Sheikha, GTaha, MO Elaborate ligand-based pharmacophore exploration and QSAR analysis guide the synthesis of novel pyridinium-based potent beta-secretase inhibitory leads. Bioorg Med Chem 18:3088-115 (2010)  
Target
Name:
Beta-secretase 1
Synonyms:
ASP2 Aspartyl protease 2 BACE1 Beta-secretase (BACE) Beta-secretase 1 (BACE 1) Beta-secretase 1 (BACE1) Beta-site amyloid precursor protein cleaving enzyme 1 Memapsin-2 beta-Secretase (BACE-1) | beta-Secretase (BACE1)
Type:
Protein
Mol. Mass.:
55755.10
Organism:
Homo sapiens (Human)
Description:
P56817
Residue:
501
  
Inhibitor
Name:
BDBM50320652
Synonyms:
CHEMBL1164610 | N-(2-(2-methylpiperidin-1-yl)ethyl)-2-oxo-6-(piperidin-1-ylsulfonyl)-1,2-dihydroquinoline-4-carboxamide
Type:
Small organic molecule
Emp. Form.:
C23H32N4O4S
Mol. Mass.:
460.59
SMILES:
CC1CCCCN1CCNC(=O)c1cc(=O)[nH]c2ccc(cc12)S(=O)(=O)N1CCCCC1
: