Target
Polyphenol oxidase 2
Ligand
BDBM50320721
Substrate
Meas. Tech.
ChEMBL_639017 (CHEMBL1166155)
Ki
1010±n/a nM
Citation
 Ghani, UUllah, N New potent inhibitors of tyrosinase: novel clues to binding of 1,3,4-thiadiazole-2(3H)-thiones, 1,3,4-oxadiazole-2(3H)-thiones, 4-amino-1,2,4-triazole-5(4H)-thiones, and substituted hydrazides to the dicopper active site. Bioorg Med Chem 18:4042-8 (2010)  
Target
Name:
Polyphenol oxidase 2
Synonyms:
Monophenol monooxygenase PPO2 Tyrosinase
Type:
Protein
Mol. Mass.:
63923.66
Organism:
Agaricus bisporus (Common mushroom)
Description:
O42713
Residue:
556
  
Inhibitor
Name:
BDBM50320721
Synonyms:
4-Amino-5-pyridin-4-yl-4H-[1,2,4]triazole-3-thiol CHEMBL571510
Type:
Small organic molecule
Emp. Form.:
C7H7N5S
Mol. Mass.:
193.229
SMILES:
Nn1c(n[nH]c1=S)-c1ccncc1
: