Target
Serpin H1
Ligand
BDBM50320866
Substrate
Meas. Tech.
ChEMBL_636318 (CHEMBL1169041)
IC50
>100000±n/a nM
Citation
 Nishikawa, YTakahara, YAsada, SShigenaga, AOtaka, AKitagawa, KKoide, T A structure-activity relationship study elucidating the mechanism of sequence-specific collagen recognition by the chaperone HSP47. Bioorg Med Chem 18:3767-75 (2010)  
Target
Name:
Serpin H1
Synonyms:
Cbp1 SERPH_MOUSE | Serpinh1
Type:
PROTEIN
Mol. Mass.:
46545.13
Organism:
Mus musculus
Description:
ChEMBL_636318
Residue:
417
  
Inhibitor
Name:
BDBM50320866
Synonyms:
CHEMBL1163326
Type:
Small organic molecule
Emp. Form.:
C109H162N32O35
Mol. Mass.:
2480.646
SMILES:
NC(=O)CC[C@H](NC(=O)[C@@H]1CCCN1C(=O)CNC(=O)[C@@H]1C[C@@H](O)CN1C(=O)[C@@H]1CCCN1C(=O)CNC(=O)[C@@H]1C[C@@H](O)CN1C(=O)[C@@H]1CCCN1C(=O)CNC(=O)[C@@H]1C[C@@H](O)CN1C(=O)[C@@H]1CCCN1)C(=O)NCC(=O)N1CCC[C@H]1C(=O)N[C@@H](CCCNC(N)=N)C(=O)NCC(=O)N1CCC[C@H]1C(=O)N1C[C@H](O)C[C@H]1C(=O)NCC(=O)N1CCC[C@H]1C(=O)N1C[C@H](O)C[C@H]1C(=O)NCC(=O)N1CCC[C@H]1C(=O)N1C[C@H](O)C[C@H]1C(=O)NCC(=O)N1CCC[C@H]1C(=O)N1C[C@H](O)C[C@H]1C(=O)NCC(N)=O
: