Target
Sigma non-opioid intracellular receptor 1
Ligand
BDBM50170654
Substrate
Meas. Tech.
ChEMBL_637407 (CHEMBL1166340)
Ki
0.08±n/a nM
Citation
 Hajipour, ARFontanilla, DChu, UBArbabian, MRuoho, AE Synthesis and characterization of N,N-dialkyl and N-alkyl-N-aralkyl fenpropimorph-derived compounds as high affinity ligands for sigma receptors. Bioorg Med Chem 18:4397-404 (2010)  
Target
Name:
Sigma non-opioid intracellular receptor 1
Synonyms:
Aging-associated gene 8 protein SGMR1_HUMAN SIGMAR1 SR31747-binding protein Sigma 1-type opioid receptor Sigma1R | hSigmaR1
Type:
Enzyme Catalytic Domain
Mol. Mass.:
25124.85
Organism:
Homo sapiens (Human)
Description:
Q99720
Residue:
223
  
Inhibitor
Name:
BDBM50170654
Synonyms:
(+-)-cis-4-(3-(4-tert-butylphenyl)-2-methylpropyl)-2,6-dimethylmorpholine CHEMBL372700 cis-4-(3-(4-(1,1-dimethylethyl)phenyl)-2-methylpropyl)-2,6-dimethylmorpholine cis-fenpropimorph fenpropimorph cis-form | fenpropimorphe
Type:
Small organic molecule
Emp. Form.:
C20H33NO
Mol. Mass.:
303.4821
SMILES:
CC(CN1C[C@H](C)O[C@H](C)C1)Cc1ccc(cc1)C(C)(C)C
: