Target
11-beta-hydroxysteroid dehydrogenase 1
Ligand
BDBM50321140
Substrate
Meas. Tech.
ChEMBL_637913 (CHEMBL1169304)
IC50
7000±n/a nM
Citation
 Dossetter, AG A statistical analysis of in vitro human microsomal metabolic stability of small phenyl group substituents, leading to improved design sets for parallel SAR exploration of a chemical series. Bioorg Med Chem 18:4405-14 (2010)  
Target
Name:
11-beta-hydroxysteroid dehydrogenase 1
Synonyms:
11-DH 11-beta-Hydroxysteroid Dehydrogenase 1 (11-beta-HSD1) 11-beta-hydroxysteroid dehydrogenase 1 (11HSD1) Corticosteroid 11-beta-dehydrogenase isozyme 1 (11-beta-HSD-1) Corticosteroid 11-beta-dehydrogenase isozyme 1 (11beta-HSD1) HSD11 HSD11L | SDR26C1
Type:
Enzyme
Mol. Mass.:
32409.16
Organism:
Homo sapiens (Human)
Description:
P28845
Residue:
292
  
Inhibitor
Name:
BDBM50321140
Synonyms:
(4-(4-fluorobenzoyl)piperidin-1-yl)(4-(trifluoromethyl)phenyl)methanone | CHEMBL1163814
Type:
Small organic molecule
Emp. Form.:
C20H17F4NO2
Mol. Mass.:
379.3481
SMILES:
Fc1ccc(cc1)C(=O)C1CCN(CC1)C(=O)c1ccc(cc1)C(F)(F)F
: