Target
11-beta-hydroxysteroid dehydrogenase 1
Ligand
BDBM50321142
Substrate
Meas. Tech.
ChEMBL_637913 (CHEMBL1169304)
IC50
5930±n/a nM
Citation
 Dossetter, AG A statistical analysis of in vitro human microsomal metabolic stability of small phenyl group substituents, leading to improved design sets for parallel SAR exploration of a chemical series. Bioorg Med Chem 18:4405-14 (2010)  
Target
Name:
11-beta-hydroxysteroid dehydrogenase 1
Synonyms:
11-DH 11-beta-Hydroxysteroid Dehydrogenase 1 (11-beta-HSD1) 11-beta-hydroxysteroid dehydrogenase 1 (11HSD1) Corticosteroid 11-beta-dehydrogenase isozyme 1 (11-beta-HSD-1) Corticosteroid 11-beta-dehydrogenase isozyme 1 (11beta-HSD1) HSD11 HSD11L | SDR26C1
Type:
Enzyme
Mol. Mass.:
32409.16
Organism:
Homo sapiens (Human)
Description:
P28845
Residue:
292
  
Inhibitor
Name:
BDBM50321142
Synonyms:
(4-(4-fluorobenzoyl)piperidin-1-yl)(m-tolyl)methanone | CHEMBL1164070
Type:
Small organic molecule
Emp. Form.:
C20H20FNO2
Mol. Mass.:
325.3767
SMILES:
Cc1cccc(c1)C(=O)N1CCC(CC1)C(=O)c1ccc(F)cc1
: