Target
11-beta-hydroxysteroid dehydrogenase 1
Ligand
BDBM50321174
Substrate
Meas. Tech.
ChEMBL_637913 (CHEMBL1169304)
IC50
12800±n/a nM
Citation
 Dossetter, AG A statistical analysis of in vitro human microsomal metabolic stability of small phenyl group substituents, leading to improved design sets for parallel SAR exploration of a chemical series. Bioorg Med Chem 18:4405-14 (2010)  
Target
Name:
11-beta-hydroxysteroid dehydrogenase 1
Synonyms:
11-DH 11-beta-Hydroxysteroid Dehydrogenase 1 (11-beta-HSD1) 11-beta-hydroxysteroid dehydrogenase 1 (11HSD1) Corticosteroid 11-beta-dehydrogenase isozyme 1 (11-beta-HSD-1) Corticosteroid 11-beta-dehydrogenase isozyme 1 (11beta-HSD1) HSD11 HSD11L | SDR26C1
Type:
Enzyme
Mol. Mass.:
32409.16
Organism:
Homo sapiens (Human)
Description:
P28845
Residue:
292
  
Inhibitor
Name:
BDBM50321174
Synonyms:
(1-(2-aminobenzoyl)piperidin-4-yl)(4-fluorophenyl)methanone | CHEMBL1163740
Type:
Small organic molecule
Emp. Form.:
C19H19FN2O2
Mol. Mass.:
326.3648
SMILES:
Nc1ccccc1C(=O)N1CCC(CC1)C(=O)c1ccc(F)cc1
: