Target
Sodium/glucose cotransporter 1
Ligand
BDBM50321291
Substrate
Meas. Tech.
ChEMBL_638423 (CHEMBL1167869)
IC50
>10000±n/a nM
Citation
 Xu, BFeng, YLv, BXu, GZhang, LDu, JPeng, KXu, MDong, JZhang, WZhang, TZhu, LDing, HSheng, ZWelihinda, ASeed, BChen, Y ortho-Substituted C-aryl glucosides as highly potent and selective renal sodium-dependent glucose co-transporter 2 (SGLT2) inhibitors. Bioorg Med Chem 18:4422-32 (2010)  
Target
Name:
Sodium/glucose cotransporter 1
Synonyms:
High affinity sodium-glucose cotransporter Na(+)/glucose cotransporter 1 SGLT1 Sodium-dependent glucose cotransporter 1 (SGLT1) Sodium/glucose cotransporter 1 (SGLT1) | Solute carrier family 5 member 1
Type:
Protein
Mol. Mass.:
73503.78
Organism:
Homo sapiens (Human)
Description:
P13866
Residue:
664
  
Inhibitor
Name:
BDBM50321291
Synonyms:
(2S,3R,4R,5S,6R)-2-(4-chloro-5-(4-ethylbenzyl)-2-((2-methoxyethoxy)methyl)phenyl)-6-(hydroxymethyl)-tetrahydro-2H-pyran-3,4,5-triol | CHEMBL1163532
Type:
Small organic molecule
Emp. Form.:
C25H33ClO7
Mol. Mass.:
480.978
SMILES:
CCc1ccc(Cc2cc([C@@H]3O[C@H](CO)[C@@H](O)[C@H](O)[C@H]3O)c(COCCOC)cc2Cl)cc1
: