Target
Prothrombin
Ligand
BDBM50321726
Substrate
Meas. Tech.
ChEMBL_640846 (CHEMBL1173914)
IC50
>2500±n/a nM
Citation
 Gademann, KPortmann, CBlom, JFZeder, MJüttner, F Multiple toxin production in the cyanobacterium microcystis: isolation of the toxic protease inhibitor cyanopeptolin 1020. J Nat Prod 73:980-4 (2010)  
Target
Name:
Prothrombin
Synonyms:
Activation peptide fragment 1 Coagulation factor II Prothrombin precursor Thrombin heavy chain | Thrombin light chain
Type:
Protein
Mol. Mass.:
70029.57
Organism:
Homo sapiens (Human)
Description:
P00734
Residue:
622
  
Inhibitor
Name:
BDBM50321726
Synonyms:
CHEMBL1172449 | cyanopeptolin 1020
Type:
Small organic molecule
Emp. Form.:
C50H72N10O13
Mol. Mass.:
1021.1659
SMILES:
[#6]-[#6]-[#6]-[#6]-[#6]-[#6](=O)-[#7]-[#6](-[#6]-[#6]-[#6](-[#8-])=O)-[#6](=O)-[#7]-[#6]-1-[#6](-[#6])-[#8]-[#6](=O)-[#6](-[#7]-[#6](=O)-[#6](-[#6]-c2ccc(-[#8])cc2)-[#7](-[#6])-[#6](=O)-[#6](-[#6]-c2ccccc2)-[#7]-2-[#6](-[#8])-[#6]-[#6]-[#6](-[#7]-[#6](=O)-[#6](-[#6]-[#6]-[#6]\[#7+]=[#6](\[#7])-[#7])-[#7]-[#6]-1=O)-[#6]-2=O)-[#6](-[#6])-[#6]
: