Target
Sigma non-opioid intracellular receptor 1
Ligand
BDBM50321798
Substrate
Meas. Tech.
ChEMBL_641177 (CHEMBL1174684)
Ki
0.32±n/a nM
Citation
 Oberdorf, CSchmidt, TJWünsch, B 5D-QSAR for spirocyclic sigma1 receptor ligands by Quasar receptor surface modeling. Eur J Med Chem 45:3116-24 (2010)  
Target
Name:
Sigma non-opioid intracellular receptor 1
Synonyms:
OPRS1 SIGMAR1 Sigma non-opioid intracellular receptor 1 Sigma1-receptor Sterol isomerase-like protein
Type:
Protein
Mol. Mass.:
25307.17
Organism:
Cavia porcellus (Guinea pig)
Description:
Q60492
Residue:
223
  
Inhibitor
Name:
BDBM50321798
Synonyms:
(R)-1-benzyl-6'-methoxy-6',7'-dihydrospiro[piperidine-4,4'-thieno[3,2-c]pyran] | CHEMBL1169950
Type:
Small organic molecule
Emp. Form.:
C19H23NO2S
Mol. Mass.:
329.456
SMILES:
CO[C@H]1Cc2sccc2C2(CCN(Cc3ccccc3)CC2)O1
: