Target
Metallo-beta-lactamase L1 type 3
Ligand
BDBM50322613
Substrate
Meas. Tech.
ChEMBL_641774 (CHEMBL1177097)
Ki
4000±n/a nM
Citation
 Lassaux, PHamel, MGulea, MDelbrück, HMercuri, PSHorsfall, LDehareng, DKupper, MFrère, JMHoffmann, KGalleni, MBebrone, C Mercaptophosphonate compounds as broad-spectrum inhibitors of the metallo-beta-lactamases. J Med Chem 53:4862-76 (2010)  
Target
Name:
Metallo-beta-lactamase L1 type 3
Synonyms:
BLA1_STEMA | Beta-lactamase L1
Type:
PROTEIN
Mol. Mass.:
30803.13
Organism:
Stenotrophomonas maltophilia
Description:
ChEMBL_1500319
Residue:
290
  
Inhibitor
Name:
BDBM50322613
Synonyms:
CHEMBL1173798 | alpha-Sulfanyl(2-methoxybenzyl)phosphonic acid
Type:
Small organic molecule
Emp. Form.:
C8H11O4PS
Mol. Mass.:
234.209
SMILES:
COc1ccccc1C(=S)P(O)(O)O
: