Target
Metallo-beta-lactamase type 2
Ligand
BDBM50322611
Substrate
Meas. Tech.
ChEMBL_641771 (CHEMBL1177094)
Ki
>40000±n/a nM
Citation
 Lassaux, PHamel, MGulea, MDelbrück, HMercuri, PSHorsfall, LDehareng, DKupper, MFrère, JMHoffmann, KGalleni, MBebrone, C Mercaptophosphonate compounds as broad-spectrum inhibitors of the metallo-beta-lactamases. J Med Chem 53:4862-76 (2010)  
Target
Name:
Metallo-beta-lactamase type 2
Synonyms:
BLAB_AERHY cphA
Type:
PROTEIN
Mol. Mass.:
28022.56
Organism:
Aeromonas hydrophila
Description:
ChEMBL_641771
Residue:
254
  
Inhibitor
Name:
BDBM50322611
Synonyms:
5-Fluoro-2-sulfanyl-phenylphosphonic acid | CHEMBL1170425
Type:
Small organic molecule
Emp. Form.:
C6H6FO3PS
Mol. Mass.:
208.147
SMILES:
OP(O)(=O)c1cc(F)ccc1S
: