Target
C3a anaphylatoxin chemotactic receptor
Ligand
BDBM50322632
Substrate
Meas. Tech.
ChEMBL_642034 (CHEMBL1176066)
EC50
1100±n/a nM
Citation
 Scully, CCBlakeney, JSSingh, RHoang, HNAbbenante, GReid, RCFairlie, DP Selective hexapeptide agonists and antagonists for human complement C3a receptor. J Med Chem 53:4938-48 (2010)  
Target
Name:
C3a anaphylatoxin chemotactic receptor
Synonyms:
AZ3B C3AR1 C3R1 HNFAG09
Type:
PROTEIN
Mol. Mass.:
53864.66
Organism:
Homo sapiens (Human)
Description:
ChEMBL_642034
Residue:
482
  
Inhibitor
Name:
BDBM50322632
Synonyms:
(S)-2-((S)-2-((S)-2-((S)-1-((S)-2-((S)-2-amino-3-phenylpropanamido)-4-phenylbutanoyl)pyrrolidine-2-carboxamido)-4-methylpentanamido)propanamido)-5-guanidinopentanoic acid | CHEMBL1170045
Type:
Small organic molecule
Emp. Form.:
C39H57N9O7
Mol. Mass.:
763.926
SMILES:
[#6]-[#6](-[#6])-[#6]-[#6@H](-[#7]-[#6](=O)-[#6@@H]-1-[#6]-[#6]-[#6]-[#7]-1-[#6](=O)-[#6@H](-[#6]-[#6]-c1ccccc1)-[#7]-[#6](=O)-[#6@@H](-[#7])-[#6]-c1ccccc1)-[#6](=O)-[#7]-[#6@@H](-[#6])-[#6](=O)-[#7]-[#6@@H](-[#6]-[#6]-[#6]\[#7]=[#6](/[#7])-[#7])-[#6](-[#8])=O
: