Target
C3a anaphylatoxin chemotactic receptor
Ligand
BDBM50322619
Substrate
Meas. Tech.
ChEMBL_642036 (CHEMBL1176068)
IC50
740±n/a nM
Citation
 Scully, CCBlakeney, JSSingh, RHoang, HNAbbenante, GReid, RCFairlie, DP Selective hexapeptide agonists and antagonists for human complement C3a receptor. J Med Chem 53:4938-48 (2010)  
Target
Name:
C3a anaphylatoxin chemotactic receptor
Synonyms:
AZ3B C3AR1 C3R1 HNFAG09
Type:
PROTEIN
Mol. Mass.:
53864.66
Organism:
Homo sapiens (Human)
Description:
ChEMBL_642034
Residue:
482
  
Inhibitor
Name:
BDBM50322619
Synonyms:
(3S,6S,9S,12S,15S)-15-amino-6-(4-aminobutyl)-9-benzyl-3-((S)-1-((S)-2-((S)-1-((R)-1-((S)-1-carboxy-4-guanidinobutylamino)-1-oxopropan-2-ylamino)-4-methyl-1-oxopentan-2-ylcarbamoyl)pyrrolidin-1-yl)-4-(methylthio)-1-oxobutan-2-ylcarbamoyl)-12-(hydroxymethyl)-16-(4-hydroxyphenyl)-4-methyl-5,8,11,14-tetraoxo-4,7,10,13-tetraazahexadecan-1-oic acid | CHEMBL1170027
Type:
Small organic molecule
Emp. Form.:
C57H88N14O15S
Mol. Mass.:
1241.458
SMILES:
[#6]-[#16]-[#6]-[#6]-[#6@H](-[#7]-[#6](=O)-[#6@H](-[#6]-[#6](-[#8])=O)-[#7](-[#6])-[#6](=O)-[#6@H](-[#6]-[#6]-[#6]-[#6]-[#7])-[#7]-[#6](=O)-[#6@H](-[#6]-c1ccccc1)-[#7]-[#6](=O)-[#6@H](-[#6]-[#8])-[#7]-[#6](=O)-[#6@@H](-[#7])-[#6]-c1ccc(-[#8])cc1)-[#6](=O)-[#7]-1-[#6]-[#6]-[#6]-[#6@H]-1-[#6](=O)-[#7]-[#6@@H](-[#6]-[#6](-[#6])-[#6])-[#6](=O)-[#7]-[#6@H](-[#6])-[#6](=O)-[#7]-[#6@@H](-[#6]-[#6]-[#6]\[#7]=[#6](/[#7])-[#7])-[#6](-[#8])=O
: