Target
Ectonucleotide pyrophosphatase/phosphodiesterase family member 2
Ligand
BDBM50322704
Substrate
Meas. Tech.
ChEMBL_642245 (CHEMBL1176954)
IC50
261±n/a nM
Citation
 Albers, HMvan Meeteren, LAEgan, DAvan Tilburg, EWMoolenaar, WHOvaa, H Discovery and optimization of boronic acid based inhibitors of autotaxin. J Med Chem 53:4958-67 (2010)  
Target
Name:
Ectonucleotide pyrophosphatase/phosphodiesterase family member 2
Synonyms:
ATX Autotaxin (ATX) ENPP2 Ectonucleotide Pyrophosphatase/Phosphodiesterase 2 (ENPP2) Extracellular lysophospholipase D PDNP2
Type:
Enzyme
Mol. Mass.:
99007.13
Organism:
Homo sapiens (Human)
Description:
Q13822
Residue:
863
  
Inhibitor
Name:
BDBM50322704
Synonyms:
CHEMBL1173377 | N-(3-chlorophenyl)-2-(6-(1,3-dioxoisoindolin-2-yl)benzo[d]thiazol-2-ylthio)acetamide
Type:
Small organic molecule
Emp. Form.:
C23H14ClN3O3S2
Mol. Mass.:
479.959
SMILES:
Clc1cccc(NC(=O)CSc2nc3ccc(cc3s2)N2C(=O)c3ccccc3C2=O)c1
: