Target
Ectonucleotide pyrophosphatase/phosphodiesterase family member 2
Ligand
BDBM50322728
Substrate
Meas. Tech.
ChEMBL_642246 (CHEMBL1176955)
IC50
30±n/a nM
Citation
 Albers, HMvan Meeteren, LAEgan, DAvan Tilburg, EWMoolenaar, WHOvaa, H Discovery and optimization of boronic acid based inhibitors of autotaxin. J Med Chem 53:4958-67 (2010)  
Target
Name:
Ectonucleotide pyrophosphatase/phosphodiesterase family member 2
Synonyms:
ATX Autotaxin (ATX) ENPP2 Ectonucleotide Pyrophosphatase/Phosphodiesterase 2 (ENPP2) Extracellular lysophospholipase D PDNP2
Type:
Enzyme
Mol. Mass.:
99007.13
Organism:
Homo sapiens (Human)
Description:
Q13822
Residue:
863
  
Inhibitor
Name:
BDBM50322728
Synonyms:
4-[(3-{[3-(4-Fluorobenzyl)-2,4-dioxo-1,3-thiazolan-5-yliden]-methyl}phenoxy)methyl]benzeneboronic Acid | CHEMBL1173627
Type:
Small organic molecule
Emp. Form.:
C24H19BFNO5S
Mol. Mass.:
463.286
SMILES:
OB(O)c1ccc(COc2cccc(\C=C3/SC(=O)N(Cc4ccc(F)cc4)C3=O)c2)cc1
: