Target
Glycogen synthase kinase-3 beta
Ligand
BDBM50322824
Substrate
Meas. Tech.
ChEMBL_644429 (CHEMBL1211213)
IC50
>20000±n/a nM
Citation
 Ibrahim, NMouawad, LLegraverend, M Novel 8-arylated purines as inhibitors of glycogen synthase kinase. Eur J Med Chem 45:3389-93 (2010)  
Target
Name:
Glycogen synthase kinase-3 beta
Synonyms:
GSK-3 beta GSK3B Glycogen synthase kinase 3 beta (GSK3B) Glycogen synthase kinase-3 beta (GSK-3B) Glycogen synthase kinase-3 beta (GSK3B) Glycogen synthase kinase-3beta (GSK3B) | Serine/threonine-protein kinase GSK3B
Type:
Enzyme
Mol. Mass.:
46756.38
Organism:
Homo sapiens (Human)
Description:
P49841
Residue:
420
  
Inhibitor
Name:
BDBM50322824
Synonyms:
CHEMBL1210477 | N-(8-(naphthalen-2-yl)-9H-purin-6-yl)pentanamide
Type:
Small organic molecule
Emp. Form.:
C20H19N5O
Mol. Mass.:
345.3978
SMILES:
CCCCC(=O)Nc1ncnc2nc([nH]c12)-c1ccc2ccccc2c1
: