Target
Neuropeptide S receptor
Ligand
BDBM50322841
Substrate
Meas. Tech.
ChEMBL_644490 (CHEMBL1211328)
IC50
398±n/a nM
Citation
 Melamed, JYZartman, AEKett, NRGotter, ALUebele, VNReiss, DRCondra, CLFandozzi, CLubbers, LSRowe, BAMcGaughey, GBHenault, MStocco, RRenger, JJHartman, GDBilodeau, MTTrotter, BW Synthesis and evaluation of a new series of Neuropeptide S receptor antagonists. Bioorg Med Chem Lett 20:4700-3 (2010)  
Target
Name:
Neuropeptide S receptor
Synonyms:
GPR154 NPSR1 PGR14
Type:
PROTEIN
Mol. Mass.:
42692.30
Organism:
Homo sapiens (Human)
Description:
ChEMBL_1276607
Residue:
371
  
Inhibitor
Name:
BDBM50322841
Synonyms:
CHEMBL1210412 | rac-N-((1-methyl-2-oxo-1,2-dihydroquinolin-3-yl)methyl)-N-(1-(2-morpholinoethyl)cyclohexyl)cyclohexanecarboxamide
Type:
Small organic molecule
Emp. Form.:
C30H43N3O3
Mol. Mass.:
493.6807
SMILES:
Cn1c2ccccc2cc(CN(C(=O)C2CCCCC2)C2(CCN3CCOCC3)CCCCC2)c1=O
: