Target
Adenosine receptor A3
Ligand
BDBM50190706
Substrate
Meas. Tech.
ChEMBL_644538 (CHEMBL1211415)
Ki
>1000±n/a nM
Citation
 Cheng, FXu, ZLiu, GTang, Y Insights into binding modes of adenosine A(2B) antagonists with ligand-based and receptor-based methods. Eur J Med Chem 45:3459-71 (2010)  
Target
Name:
Adenosine receptor A3
Synonyms:
A3 adenosine receptor (hA3) ADORA3 | Adenosine A3 receptor (A3AR)
Type:
G Protein-Coupled Receptor (GPCR)
Mol. Mass.:
36197.32
Organism:
Homo sapiens (Human)
Description:
P0DMS8
Residue:
318
  
Inhibitor
Name:
BDBM50190706
Synonyms:
8-[4-(benzylamidosulfonyl)phenyl]-1-propylxanthine N-benzyl-4-(2,6-dioxo-1-propyl-2,3,6,7-tetrahydro-1H-purin-8-yl)benzenesulfonamide
Type:
Small organic molecule
Emp. Form.:
C21H21N5O4S
Mol. Mass.:
439.488
SMILES:
CCCn1c(=O)[nH]c2nc([nH]c2c1=O)-c1ccc(cc1)S(=O)(=O)NCc1ccccc1
: